Reaction Details
TargetMetabotropic glutamate receptor 5
LigandBDBM50400331
Substrate/Competitorn/a
Meas. Tech.ChEMBL_877027 (CHEMBL2186352)
IC50>10000±n/a nM
Citation Fujinaga, MYamasaki, TMaeda, JYui, JXie, LNagai, YNengaki, NHatori, AKumata, KKawamura, KZhang, MR Development of N-[4-[6-(isopropylamino)pyrimidin-4-yl]-1,3-thiazol-2-yl]-N-methyl-4-[11C]methylbenzamide for positron emission tomography imaging of metabotropic glutamate 1 receptor in monkey brain. J Med Chem55:11042-51 (2012) 
 
Metabotropic glutamate receptor 5
Name:Metabotropic glutamate receptor 5
Type:Enzyme
Mol. Mass.:131900.14
Organism:Rattus norvegicus (Rat)
Description:P31424
Residue:1203
BDBM50400331
NameBDBM50400331
Synonyms:CHEMBL2181520
TypeSmall organic molecule
Emp. Form.C19H21N5OS
Mol. Mass.367.468
SMILESCC(C)Nc1cc(ncn1)-c1csc(n1)N(C)C(=O)c1ccc(C)cc1