Reaction Details
TargetMetabotropic glutamate receptor 1
LigandBDBM50400330
Substrate/Competitorn/a
Meas. Tech.ChEMBL_877026 (CHEMBL2186351)
Ki 27.3±n/a nM
Citation Fujinaga, MYamasaki, TMaeda, JYui, JXie, LNagai, YNengaki, NHatori, AKumata, KKawamura, KZhang, MR Development of N-[4-[6-(isopropylamino)pyrimidin-4-yl]-1,3-thiazol-2-yl]-N-methyl-4-[11C]methylbenzamide for positron emission tomography imaging of metabotropic glutamate 1 receptor in monkey brain. J Med Chem55:11042-51 (2012) 
 
Metabotropic glutamate receptor 1
Name:Metabotropic glutamate receptor 1
Type:Enzyme Catalytic Domain
Mol. Mass.:133240.47
Organism:RAT
Description:metabotropic glutamate 1/2 0 RAT::P23385
Residue:1199
BDBM50400330
NameBDBM50400330
Synonyms:CHEMBL2181519
TypeSmall organic molecule
Emp. Form.C19H18N6OS
Mol. Mass.378.451
SMILESCC(C)Nc1cc(ncn1)-c1csc(n1)N(C)C(=O)c1ccc(cc1)C#N