Reaction Details
TargetSerine/threonine-protein kinase mTOR
LigandBDBM50400338
Substrate/Competitorn/a
Meas. Tech.ChEMBL_877066 (CHEMBL2186391)
Ki 1.5±n/a nM
Citation Koehler, MFBergeron, PBlackwood, EBowman, KKChen, YHDeshmukh, GDing, XEpler, JLau, KLee, LLiu, LLy, CMalek, SNonomiya, JOeh, JOrtwine, DFSampath, DSideris, STrinh, LTruong, TWu, JPei, ZLyssikatos, JP Potent, selective, and orally bioavailable inhibitors of the mammalian target of rapamycin kinase domain exhibiting single agent antiproliferative activity. J Med Chem55:10958-71 (2012) 
 
Serine/threonine-protein kinase mTOR
Name:Serine/threonine-protein kinase mTOR
Type:Rapamycin target protein
Mol. Mass.:288917.12
Organism:Homo sapiens (Human)
Description:P42345
Residue:2549
BDBM50400338
NameBDBM50400338
Synonyms:CHEMBL2181522
TypeSmall organic molecule
Emp. Form.C25H30N8O2
Mol. Mass.474.5581
SMILESCCNC(=O)Nc1ccc(cc1)-c1nc2CN(CCc2c(n1)N1CCOC[C@@H]1C)c1ncccn1