Reaction Details
TargetSerine/threonine-protein kinase mTOR
LigandBDBM50343759
Substrate/Competitorn/a
Meas. Tech.ChEMBL_877069 (CHEMBL2186805)
Ki 3±n/a nM
Citation Koehler, MFBergeron, PBlackwood, EBowman, KKChen, YHDeshmukh, GDing, XEpler, JLau, KLee, LLiu, LLy, CMalek, SNonomiya, JOeh, JOrtwine, DFSampath, DSideris, STrinh, LTruong, TWu, JPei, ZLyssikatos, JP Potent, selective, and orally bioavailable inhibitors of the mammalian target of rapamycin kinase domain exhibiting single agent antiproliferative activity. J Med Chem55:10958-71 (2012) 
 
Serine/threonine-protein kinase mTOR
Name:Serine/threonine-protein kinase mTOR
Type:Rapamycin target protein
Mol. Mass.:288917.12
Organism:Homo sapiens (Human)
Description:P42345
Residue:2549
BDBM50343759
NameBDBM50343759
Synonyms:1-ethyl-3-(4-(6-(2-hydroxypropan-2-yl)-4-morpholinothieno[3,2-d]pyrimidin-2-yl)phenyl)urea | CHEMBL1774349
TypeSmall organic molecule
Emp. Form.C22H27N5O3S
Mol. Mass.441.546
SMILESCCNC(=O)Nc1ccc(cc1)-c1nc(N2CCOCC2)c2sc(cc2n1)C(C)(C)O