Reaction Details
TargetReplicative DNA helicase
LigandBDBM50400417
Substrate/Competitorn/a
Meas. Tech.ChEMBL_877478 (CHEMBL2183632)
IC50 21000±n/a nM
Citation Li, BPai, RDi, MAiello, DBarnes, MHButler, MMTashjian, TFPeet, NPBowlin, TLMoir, DT Coumarin-based inhibitors of Bacillus anthracis and Staphylococcus aureus replicative DNA helicase: chemical optimization, biological evaluation, and antibacterial activities. J Med Chem55:10896-908 (2012) 
 
Replicative DNA helicase
Name:Replicative DNA helicase
Type:PROTEIN
Mol. Mass.:50177.37
Organism:Bacillus anthracis
Description:ChEMBL_877478
Residue:453
BDBM50400417
NameBDBM50400417
Synonyms:CHEMBL2178455
TypeSmall organic molecule
Emp. Form.C26H22O5
Mol. Mass.414.4499
SMILESCc1c(OCc2ccc(cc2)-c2ccccc2)ccc2cc(CCC(O)=O)c(=O)oc12