Reaction Details
TargetReplicative DNA helicase
LigandBDBM50400425
Substrate/Competitorn/a
Meas. Tech.ChEMBL_877478 (CHEMBL2183632)
IC50 6100±n/a nM
Citation Li, BPai, RDi, MAiello, DBarnes, MHButler, MMTashjian, TFPeet, NPBowlin, TLMoir, DT Coumarin-based inhibitors of Bacillus anthracis and Staphylococcus aureus replicative DNA helicase: chemical optimization, biological evaluation, and antibacterial activities. J Med Chem55:10896-908 (2012) 
 
Replicative DNA helicase
Name:Replicative DNA helicase
Type:PROTEIN
Mol. Mass.:50177.37
Organism:Bacillus anthracis
Description:ChEMBL_877478
Residue:453
BDBM50400425
NameBDBM50400425
Synonyms:CHEMBL2178447
TypeSmall organic molecule
Emp. Form.C28H23F3O5
Mol. Mass.496.4744
SMILESCc1c(OCc2ccc(cc2)-c2ccc(cc2)C(F)(F)F)ccc2c(C)c(CCC(O)=O)c(=O)oc12