Reaction Details
TargetReplicative DNA helicase
LigandBDBM50400436
Substrate/Competitorn/a
Meas. Tech.ChEMBL_877478 (CHEMBL2183632)
IC50>100000±n/a nM
Citation Li, BPai, RDi, MAiello, DBarnes, MHButler, MMTashjian, TFPeet, NPBowlin, TLMoir, DT Coumarin-based inhibitors of Bacillus anthracis and Staphylococcus aureus replicative DNA helicase: chemical optimization, biological evaluation, and antibacterial activities. J Med Chem55:10896-908 (2012) 
 
Replicative DNA helicase
Name:Replicative DNA helicase
Type:PROTEIN
Mol. Mass.:50177.37
Organism:Bacillus anthracis
Description:ChEMBL_877478
Residue:453
BDBM50400436
NameBDBM50400436
Synonyms:CHEMBL2177805
TypeSmall organic molecule
Emp. Form.C23H19NO5
Mol. Mass.389.4007
SMILESCc1c(CCC(O)=O)c(=O)oc2cc(OCc3nccc4ccccc34)ccc12