Reaction Details
TargetReplicative DNA helicase
LigandBDBM50400437
Substrate/Competitorn/a
Meas. Tech.ChEMBL_877478 (CHEMBL2183632)
IC50>100000±n/a nM
Citation Li, BPai, RDi, MAiello, DBarnes, MHButler, MMTashjian, TFPeet, NPBowlin, TLMoir, DT Coumarin-based inhibitors of Bacillus anthracis and Staphylococcus aureus replicative DNA helicase: chemical optimization, biological evaluation, and antibacterial activities. J Med Chem55:10896-908 (2012) 
 
Replicative DNA helicase
Name:Replicative DNA helicase
Type:PROTEIN
Mol. Mass.:50177.37
Organism:Bacillus anthracis
Description:ChEMBL_877478
Residue:453
BDBM50400437
NameBDBM50400437
Synonyms:CHEMBL2177804
TypeSmall organic molecule
Emp. Form.C24H21NO5
Mol. Mass.403.4272
SMILESCc1c(OCc2nccc3ccccc23)ccc2c(C)c(CCC(O)=O)c(=O)oc12