Reaction Details
TargetdTMP kinase
LigandBDBM50400448
Substrate/Competitorn/a
Meas. Tech.ChEMBL_877484 (CHEMBL2183638)
Ki 50000±n/a nM
Citation Cui, HCarrero-Lérida, JSilva, APWhittingham, JLBrannigan, JARuiz-Pérez, LMRead, KDWilson, KSGonzález-Pacanowska, DGilbert, IH Synthesis and evaluation ofa-thymidine analogues as novel antimalarials. J Med Chem55:10948-57 (2012) 
 
dTMP kinase
Name:dTMP kinase
Type:PROTEIN
Mol. Mass.:24691.81
Organism:Plasmodium falciparum (isolate 3D7)
Description:ChEMBL_877484
Residue:210
BDBM50400448
NameBDBM50400448
Synonyms:CHEMBL2179045
TypeSmall organic molecule
Emp. Form.C18H22N4O6
Mol. Mass.390.3905
SMILESCOc1ccc(NC(=O)NC[C@H]2O[C@H](C[C@@H]2O)n2cc(C)c(=O)[nH]c2=O)cc1