Reaction Details
TargetdTMP kinase
LigandBDBM50400456
Substrate/Competitorn/a
Meas. Tech.ChEMBL_877484 (CHEMBL2183638)
Ki 52000±n/a nM
Citation Cui, HCarrero-Lérida, JSilva, APWhittingham, JLBrannigan, JARuiz-Pérez, LMRead, KDWilson, KSGonzález-Pacanowska, DGilbert, IH Synthesis and evaluation ofa-thymidine analogues as novel antimalarials. J Med Chem55:10948-57 (2012) 
 
dTMP kinase
Name:dTMP kinase
Type:PROTEIN
Mol. Mass.:24691.81
Organism:Plasmodium falciparum (isolate 3D7)
Description:ChEMBL_877484
Residue:210
BDBM50400456
NameBDBM50400456
Synonyms:CHEMBL2179037
TypeSmall organic molecule
Emp. Form.C17H19ClN4O5
Mol. Mass.394.81
SMILESCc1cn([C@H]2C[C@H](O)[C@@H](CNC(=O)Nc3ccccc3Cl)O2)c(=O)[nH]c1=O