Reaction Details
TargetdTMP kinase
LigandBDBM50400464
Substrate/Competitorn/a
Meas. Tech.ChEMBL_877484 (CHEMBL2183638)
Ki>1000000±n/a nM
Citation Cui, HCarrero-Lérida, JSilva, APWhittingham, JLBrannigan, JARuiz-Pérez, LMRead, KDWilson, KSGonzález-Pacanowska, DGilbert, IH Synthesis and evaluation ofa-thymidine analogues as novel antimalarials. J Med Chem55:10948-57 (2012) 
 
dTMP kinase
Name:dTMP kinase
Type:PROTEIN
Mol. Mass.:24691.81
Organism:Plasmodium falciparum (isolate 3D7)
Description:ChEMBL_877484
Residue:210
BDBM50400464
NameBDBM50400464
Synonyms:CHEMBL2178510
TypeSmall organic molecule
Emp. Form.C20H21N3O6S
Mol. Mass.431.462
SMILESCc1cn([C@H]2C[C@H](O)[C@@H](CNS(=O)(=O)c3ccc4ccccc4c3)O2)c(=O)[nH]c1=O