Reaction Details
TargetC-X-C chemokine receptor type 4
LigandBDBM50042947
Substrate/Competitorn/a
Meas. Tech.ChEMBL_879520 (CHEMBL2208929)
Ki 53±n/a nM
Citation Gasparik, VDaubeuf, FHachet-Haas, MRohmer, FGizzi, PHaiech, JGalzi, JLHibert, MBonnet, DFrossard, N Prodrugs of a CXC Chemokine-12 (CXCL12) Neutraligand Prevent Inflammatory Reactions in an Asthma Model in Vivo. ACS Med Chem Lett3:10-14 (2012) 
 
C-X-C chemokine receptor type 4
Name:C-X-C chemokine receptor type 4
Type:Enzyme
Mol. Mass.:39754.61
Organism:Homo sapiens (Human)
Description:P61073
Residue:352
BDBM50042947
NameBDBM50042947
Synonyms:1-(4-Chloro-phenyl)-3-(4-hydroxy-3-methoxy-phenyl)-propenone 4'-chloro-3-methoxy-4-hydroxychalcone Chalcone 4
TypeSmall organic molecule
Emp. Form.C16H13ClO3
Mol. Mass.288.726
SMILESCOc1cc(\C=C\C(=O)c2ccc(Cl)cc2)ccc1O