Reaction Details
TargetD(3) dopamine receptor
LigandBDBM50400515
Substrate/Competitorn/a
Meas. Tech.ChEMBL_879545 (CHEMBL2208954)
Ki 0.93±n/a nM
Citation Chen, JCollins, GTLevant, BWoods, JDeschamps, JRWang, S CJ-1639: A Potent and Highly Selective Dopamine D3 Receptor Full Agonist. ACS Med Chem Lett2:620-625 (2011) 
 
D(3) dopamine receptor
Name:D(3) dopamine receptor
Type:Protein
Mol. Mass.:49540.58
Organism:Rattus norvegicus (Rat)
Description:P19020
Residue:446
BDBM50400515
NameBDBM50400515
Synonyms:CHEMBL2203402
TypeSmall organic molecule
Emp. Form.C29H38N4O2S
Mol. Mass.506.703
SMILESCCCN(CC[C@]1(O)CC[C@@H](CC1)NC(=O)c1ccc2ccccc2c1)[C@H]1CCc2nc(N)sc2C1