Reaction Details
TargetAminopeptidase N
LigandBDBM50400529
Substrate/Competitorn/a
Meas. Tech.ChEMBL_879813 (CHEMBL2210541)
IC50 480±n/a nM
Citation Su, LCao, JJia, YZhang, XFang, HXu, W Development of Synthetic Aminopeptidase N/CD13 Inhibitors to Overcome Cancer Metastasis and Angiogenesis. ACS Med Chem Lett3:959-964 (2012) 
 
Aminopeptidase N
Name:Aminopeptidase N
Type:PROTEIN
Mol. Mass.:109522.63
Organism:Homo sapiens (Human)
Description:ChEMBL_1507526
Residue:967
BDBM50400529
NameBDBM50400529
Synonyms:CHEMBL2204943
TypeSmall organic molecule
Emp. Form.C17H21N3O3
Mol. Mass.315.3669
SMILESCC(C)C[C@H](NC(=O)Nc1cccc2ccccc12)C(=O)NO