Reaction Details
TargetVoltage-dependent N-type calcium channel subunit alpha-1B
LigandBDBM50400568
Substrate/Competitorn/a
Meas. Tech.ChEMBL_880021 (CHEMBL2212933)
EC50>100000±n/a nM
Citation Liang, MTarr, TBBravo-Altamirano, KValdomir, GRensch, GSwanson, LDeStefino, NRMazzarisi, CMOlszewski, RAWilson, GMMeriney, SDWipf, P Synthesis and biological evaluation of a selective N- and p/q-type calcium channel agonist. ACS Med Chem Lett3:985-990 (2012) 
 
Voltage-dependent N-type calcium channel subunit alpha-1B
Name:Voltage-dependent N-type calcium channel subunit alpha-1B
Type:Enzyme
Mol. Mass.:262548.16
Organism:Homo sapiens (Human)
Description:Q00975
Residue:2339
BDBM50400568
NameBDBM50400568
Synonyms:CHEMBL2206240
TypeSmall organic molecule
Emp. Form.C20H25F3N6O
Mol. Mass.422.4473
SMILESCC[C@H](CO)Nc1nc(NCc2cccc(c2)C(F)(F)F)c2ncn(C(C)C)c2n1