Reaction Details
TargetVoltage-dependent N-type calcium channel subunit alpha-1B
LigandBDBM50400577
Substrate/Competitorn/a
Meas. Tech.ChEMBL_880021 (CHEMBL2212933)
EC50>100000±n/a nM
Citation Liang, MTarr, TBBravo-Altamirano, KValdomir, GRensch, GSwanson, LDeStefino, NRMazzarisi, CMOlszewski, RAWilson, GMMeriney, SDWipf, P Synthesis and biological evaluation of a selective N- and p/q-type calcium channel agonist. ACS Med Chem Lett3:985-990 (2012) 
 
Voltage-dependent N-type calcium channel subunit alpha-1B
Name:Voltage-dependent N-type calcium channel subunit alpha-1B
Type:Enzyme
Mol. Mass.:262548.16
Organism:Homo sapiens (Human)
Description:Q00975
Residue:2339
BDBM50400577
NameBDBM50400577
Synonyms:CHEMBL2206246
TypeSmall organic molecule
Emp. Form.C23H26N6O
Mol. Mass.402.4921
SMILESCC[C@H](CO)Nc1nc(NC(c2ccccc2)c2ccccc2)c2ncn(C)c2n1