Reaction Details
TargetMyosin light chain kinase, smooth muscle
LigandBDBM50400564
Substrate/Competitorn/a
Meas. Tech.ChEMBL_880015 (CHEMBL2212927)
EC50>20000±n/a nM
Citation Liang, MTarr, TBBravo-Altamirano, KValdomir, GRensch, GSwanson, LDeStefino, NRMazzarisi, CMOlszewski, RAWilson, GMMeriney, SDWipf, P Synthesis and biological evaluation of a selective N- and p/q-type calcium channel agonist. ACS Med Chem Lett3:985-990 (2012) 
 
Myosin light chain kinase, smooth muscle
Name:Myosin light chain kinase, smooth muscle
Type:Protein
Mol. Mass.:210702.56
Organism:Homo sapiens (Human)
Description:Q15746
Residue:1914
BDBM50400564
NameBDBM50400564
Synonyms:CHEMBL2206242
TypeSmall organic molecule
Emp. Form.C18H26N6OS
Mol. Mass.374.504
SMILESCCCn1cnc2c(NCc3ccc(C)s3)nc(N[C@H](CC)CO)nc12