Reaction Details
TargetVoltage-dependent N-type calcium channel subunit alpha-1B
LigandBDBM10636
Substrate/Competitorn/a
Meas. Tech.ChEMBL_880021 (CHEMBL2212933)
EC50>1000000±n/a nM
Citation Liang, MTarr, TBBravo-Altamirano, KValdomir, GRensch, GSwanson, LDeStefino, NRMazzarisi, CMOlszewski, RAWilson, GMMeriney, SDWipf, P Synthesis and biological evaluation of a selective N- and p/q-type calcium channel agonist. ACS Med Chem Lett3:985-990 (2012) 
 
Voltage-dependent N-type calcium channel subunit alpha-1B
Name:Voltage-dependent N-type calcium channel subunit alpha-1B
Type:Enzyme
Mol. Mass.:262548.16
Organism:Homo sapiens (Human)
Description:Q00975
Residue:2339
BDBM10636
NameBDBM10636
Synonyms:2-{[6-(benzylamino)-9-(propan-2-yl)-9H-purin-2-yl]amino}ethan-1-ol 6-(benzylamino)-2-[(2-hydroxyethyl)amino]-9-isopropylpurine purine deriv. 4
TypeSmall organic molecule
Emp. Form.C17H22N6O
Mol. Mass.326.3962
SMILESCC(C)n1cnc2c(NCc3ccccc3)nc(NCCO)nc12