Reaction Details
TargetReceptor-type tyrosine-protein kinase FLT3
LigandBDBM50400600
Substrate/Competitorn/a
Meas. Tech.ChEMBL_880061 (CHEMBL2213410)
IC50 2±n/a nM
Citation Liu, GCampbell, BTHolladay, MWFord Pulido, JMHua, HGitnick, DGardner, MFJames, JBreider, MABrigham, DBelli, BArmstrong, RCTreiber, DK Discovery of AC710, a Globally Selective Inhibitor of Platelet-Derived Growth Factor Receptor-Family Kinases. ACS Med Chem Lett3:997-1002 (2012) 
 
Receptor-type tyrosine-protein kinase FLT3
Name:Receptor-type tyrosine-protein kinase FLT3
Type:Enzyme
Mol. Mass.:112888.62
Organism:Homo sapiens (Human)
Description:P36888
Residue:993
BDBM50400600
NameBDBM50400600
Synonyms:CHEMBL2206277
TypeSmall organic molecule
Emp. Form.C30H40N6O4
Mol. Mass.548.6764
SMILESCN1C(C)(C)CC(CC1(C)C)Oc1ccc(nc1)C(=O)Nc1ccc(NC(=O)Nc2cc(on2)C(C)(C)C)cc1