Reaction Details
TargetMacrophage colony-stimulating factor 1 receptor
LigandBDBM50400600
Substrate/Competitorn/a
Meas. Tech.ChEMBL_880062 (CHEMBL2213411)
IC50 15±n/a nM
Citation Liu, GCampbell, BTHolladay, MWFord Pulido, JMHua, HGitnick, DGardner, MFJames, JBreider, MABrigham, DBelli, BArmstrong, RCTreiber, DK Discovery of AC710, a Globally Selective Inhibitor of Platelet-Derived Growth Factor Receptor-Family Kinases. ACS Med Chem Lett3:997-1002 (2012) 
 
Macrophage colony-stimulating factor 1 receptor
Name:Macrophage colony-stimulating factor 1 receptor
Type:Protein
Mol. Mass.:107979.48
Organism:Homo sapiens (Human)
Description:P07333
Residue:972
BDBM50400600
NameBDBM50400600
Synonyms:CHEMBL2206277
TypeSmall organic molecule
Emp. Form.C30H40N6O4
Mol. Mass.548.6764
SMILESCN1C(C)(C)CC(CC1(C)C)Oc1ccc(nc1)C(=O)Nc1ccc(NC(=O)Nc2cc(on2)C(C)(C)C)cc1