Reaction Details
TargetPlatelet-derived growth factor receptor alpha
LigandBDBM50400601
Substrate/Competitorn/a
Meas. Tech.ChEMBL_880057 (CHEMBL2213406)
IC50 6.2±n/a nM
Citation Liu, GCampbell, BTHolladay, MWFord Pulido, JMHua, HGitnick, DGardner, MFJames, JBreider, MABrigham, DBelli, BArmstrong, RCTreiber, DK Discovery of AC710, a Globally Selective Inhibitor of Platelet-Derived Growth Factor Receptor-Family Kinases. ACS Med Chem Lett3:997-1002 (2012) 
 
Platelet-derived growth factor receptor alpha
Name:Platelet-derived growth factor receptor alpha
Type:Protein
Mol. Mass.:122633.38
Organism:Homo sapiens (Human)
Description:P16234
Residue:1089
BDBM50400601
NameBDBM50400601
Synonyms:CHEMBL2203434
TypeSmall organic molecule
Emp. Form.C27H34N6O4
Mol. Mass.506.5967
SMILESCCN1CCC(CC1)Oc1ccc(nc1)C(=O)Nc1ccc(NC(=O)Nc2cc(on2)C(C)(C)C)cc1