Reaction Details
TargetProtein-glutamine gamma-glutamyltransferase E
LigandBDBM50400619
Substrate/Competitorn/a
Meas. Tech.ChEMBL_880182 (CHEMBL2214884)
IC50>80000±n/a nM
Citation Wityak, JPrime, MEBrookfield, FACourtney, SMErfan, SJohnsen, SJohnson, PDLi, MMarston, RWReed, LVaidya, DSchaertl, SPedret-Dunn, ABeconi, MMacdonald, DMuņoz-Sanjuan, IDominguez, C SAR Development of Lysine-Based Irreversible Inhibitors of Transglutaminase 2 for Huntington's Disease. ACS Med Chem Lett3:1024-1028 (2012) 
 
Protein-glutamine gamma-glutamyltransferase E
Name:Protein-glutamine gamma-glutamyltransferase E
Type:Protein
Mol. Mass.:76625.90
Organism:Homo sapiens (Human)
Description:n/a
Residue:693
BDBM50400619
NameBDBM50400619
Synonyms:CHEMBL2203476
TypeSmall organic molecule
Emp. Form.C23H33N3O6
Mol. Mass.447.5246
SMILESCC(C)(C)OC(=O)CNC(=O)[C@H](CCCCNC(=O)C=C)NC(=O)OCc1ccccc1