Reaction Details
TargetProtein-glutamine gamma-glutamyltransferase 2
LigandBDBM50400619
Substrate/Competitorn/a
Meas. Tech.ChEMBL_880184 (CHEMBL2214886)
IC50 6200±n/a nM
Citation Wityak, JPrime, MEBrookfield, FACourtney, SMErfan, SJohnsen, SJohnson, PDLi, MMarston, RWReed, LVaidya, DSchaertl, SPedret-Dunn, ABeconi, MMacdonald, DMuņoz-Sanjuan, IDominguez, C SAR Development of Lysine-Based Irreversible Inhibitors of Transglutaminase 2 for Huntington's Disease. ACS Med Chem Lett3:1024-1028 (2012) 
 
Protein-glutamine gamma-glutamyltransferase 2
Name:Protein-glutamine gamma-glutamyltransferase 2
Type:PROTEIN
Mol. Mass.:77039.00
Organism:Mus musculus
Description:ChEMBL_841041
Residue:686
BDBM50400619
NameBDBM50400619
Synonyms:CHEMBL2203476
TypeSmall organic molecule
Emp. Form.C23H33N3O6
Mol. Mass.447.5246
SMILESCC(C)(C)OC(=O)CNC(=O)[C@H](CCCCNC(=O)C=C)NC(=O)OCc1ccccc1