Reaction Details
TargetProtein-glutamine gamma-glutamyltransferase E
LigandBDBM50400626
Substrate/Competitorn/a
Meas. Tech.ChEMBL_880182 (CHEMBL2214884)
IC50>80000±n/a nM
Citation Wityak, JPrime, MEBrookfield, FACourtney, SMErfan, SJohnsen, SJohnson, PDLi, MMarston, RWReed, LVaidya, DSchaertl, SPedret-Dunn, ABeconi, MMacdonald, DMuņoz-Sanjuan, IDominguez, C SAR Development of Lysine-Based Irreversible Inhibitors of Transglutaminase 2 for Huntington's Disease. ACS Med Chem Lett3:1024-1028 (2012) 
 
Protein-glutamine gamma-glutamyltransferase E
Name:Protein-glutamine gamma-glutamyltransferase E
Type:Protein
Mol. Mass.:76625.90
Organism:Homo sapiens (Human)
Description:n/a
Residue:693
BDBM50400626
NameBDBM50400626
Synonyms:CHEMBL2203467
TypeSmall organic molecule
Emp. Form.C28H35N3O4
Mol. Mass.477.5952
SMILESC=CC(=O)NCCCC[C@H](NC(=O)OCc1ccccc1)C(=O)N1CCC(CC1)c1ccccc1