Reaction Details
TargetProtein-glutamine gamma-glutamyltransferase 2
LigandBDBM50400633
Substrate/Competitorn/a
Meas. Tech.ChEMBL_880185 (CHEMBL2214887)
IC50 55±n/a nM
Citation Wityak, JPrime, MEBrookfield, FACourtney, SMErfan, SJohnsen, SJohnson, PDLi, MMarston, RWReed, LVaidya, DSchaertl, SPedret-Dunn, ABeconi, MMacdonald, DMuņoz-Sanjuan, IDominguez, C SAR Development of Lysine-Based Irreversible Inhibitors of Transglutaminase 2 for Huntington's Disease. ACS Med Chem Lett3:1024-1028 (2012) 
 
Protein-glutamine gamma-glutamyltransferase 2
Name:Protein-glutamine gamma-glutamyltransferase 2
Type:Protein
Mol. Mass.:77309.30
Organism:Homo sapiens (Human)
Description:P21980
Residue:687
BDBM50400633
NameBDBM50400633
Synonyms:CHEMBL2203473
TypeSmall organic molecule
Emp. Form.C27H35N5O4
Mol. Mass.493.5979
SMILESCc1cccc(n1)N1CCN(CC1)C(=O)[C@H](CCCCNC(=O)C=C)NC(=O)OCc1ccccc1