Reaction Details
TargetProtein-glutamine gamma-glutamyltransferase 2
LigandBDBM50400625
Substrate/Competitorn/a
Meas. Tech.ChEMBL_880185 (CHEMBL2214887)
IC50 62±n/a nM
Citation Wityak, JPrime, MEBrookfield, FACourtney, SMErfan, SJohnsen, SJohnson, PDLi, MMarston, RWReed, LVaidya, DSchaertl, SPedret-Dunn, ABeconi, MMacdonald, DMuņoz-Sanjuan, IDominguez, C SAR Development of Lysine-Based Irreversible Inhibitors of Transglutaminase 2 for Huntington's Disease. ACS Med Chem Lett3:1024-1028 (2012) 
 
Protein-glutamine gamma-glutamyltransferase 2
Name:Protein-glutamine gamma-glutamyltransferase 2
Type:Protein
Mol. Mass.:77309.30
Organism:Homo sapiens (Human)
Description:P21980
Residue:687
BDBM50400625
NameBDBM50400625
Synonyms:CHEMBL2203469
TypeSmall organic molecule
Emp. Form.C27H33ClN4O4
Mol. Mass.513.028
SMILESClc1ccccc1N1CCN(CC1)C(=O)[C@H](CCCCNC(=O)C=C)NC(=O)OCc1ccccc1