Reaction Details
TargetNeuronal acetylcholine receptor; alpha2/beta4
LigandBDBM82070
Substrate/Competitorn/a
Meas. Tech.ChEMBL_880410 (CHEMBL2210093)
Ki 70±n/a nM
Citation Yu, LFZhang, HKGunosewoyo, HKozikowski, AP From a4ß2 Nicotinic Ligands to the Discovery of s1 Receptor Ligands: Pharmacophore Analysis and Rational Design. ACS Med Chem Lett3:1054-1058 (2012) 
 
Neuronal acetylcholine receptor; alpha2/beta4
Name:Neuronal acetylcholine receptor; alpha2/beta4
Type:n/a
Mol. Mass.:n/a
Description:ASSAY_ID of ChEMBL is 2150172
Components:This complex has 2 components.
Component 1
Name:Neuronal acetylcholine receptor subunit beta-4
Synonyms:ACHB4_HUMAN Cholinergic, Nicotinic Alpha6Beta3Beta4Alpha5 Nicotinic acetylcholine receptor alpha6/alpha3/beta4
Type:Enzyme Catalytic Domain
Mol. Mass.:56388.51
Organism:Homo sapiens (Human)
Description:Cholinergic, Nicotinic Alpha6Beta3Beta4Alpha5 0 HUMAN::P30926
Residue:498
Component 2
Name:Neuronal acetylcholine receptor subunit alpha-2
Synonyms:ACHA2_HUMAN Neuronal acetylcholine receptor; alpha2/beta2
Type:Enzyme Catalytic Domain
Mol. Mass.:59759.69
Organism:Homo sapiens (Human)
Description:Cholinergic, Nicotinic Alpha2Beta2 0 HUMAN::Q15822
Residue:529
BDBM82070
NameBDBM82070
Synonyms:CAS_29790-52-1 Nicotine-D salicylate US9303017, Nicotine
Typen/a
Emp. Form.C10H14N2
Mol. Mass.162.2316
SMILESCN1CCC[C@H]1c1cccnc1