Reaction Details
TargetCasein kinase I isoform alpha
LigandBDBM50400744
Substrate/Competitorn/a
Meas. Tech.ChEMBL_880534 (CHEMBL2211469)
IC50 736±n/a nM
Citation Huang, HAcquaviva, LBerry, VBregman, HChakka, NDiMauro, EFDovey, JEpstein, OGrubinska, BGoldstein, JGunaydin, HHua, ZHuang, XHuang, LHuman, JLong, ANewcomb, JPatel, VFSaffran, DSerafino, RSchneider, SStrathdee, CTang, JTurci, SWhite, RYu, VZhao, HWilson, CMartin, MW Structure-Based Design of Potent and Selective CK1¿ Inhibitors. ACS Med Chem Lett3:1059-1064 (2012) 
 
Casein kinase I isoform alpha
Name:Casein kinase I isoform alpha
Type:Serine/threonine-protein kinase
Mol. Mass.:38936.59
Organism:Homo sapiens (Human)
Description:P48729
Residue:337
BDBM50400744
NameBDBM50400744
Synonyms:CHEMBL2203560
TypeSmall organic molecule
Emp. Form.C21H20FN3O2
Mol. Mass.365.4008
SMILESCOc1cnc(CCc2ccc(F)cc2)cc1-c1cc2c(CCNC2=O)[nH]1