Reaction Details
TargetPotassium voltage-gated channel subfamily H member 2
LigandBDBM50400759
Substrate/Competitorn/a
Meas. Tech.ChEMBL_880571 (CHEMBL2211966)
IC50 13100±n/a nM
Citation Kuduk, SDChang, RKGreshock, TJRay, WJMa, LWittmann, MSeager, MAKoeplinger, KAThompson, CDHartman, GDBilodeau, MT Identification of amides as carboxylic Acid surrogates for quinolizidinone-based m1 positive allosteric modulators. ACS Med Chem Lett3:1070-1074 (2012) 
 
Potassium voltage-gated channel subfamily H member 2
Name:Potassium voltage-gated channel subfamily H member 2
Type:Multi-pass membrane protein
Mol. Mass.:126672.65
Organism:Homo sapiens (Human)
Description:Q12809
Residue:1159
BDBM50400759
NameBDBM50400759
Synonyms:CHEMBL2204278
TypeSmall organic molecule
Emp. Form.C27H30N6O3S
Mol. Mass.518.631
SMILESO[C@H]1CCCC[C@@H]1NC(=O)c1cc(CN2CCN(CC2)c2cc3scnc3cn2)c2ccccn2c1=O