Reaction Details
TargetPotassium voltage-gated channel subfamily H member 2
LigandBDBM50400760
Substrate/Competitorn/a
Meas. Tech.ChEMBL_880571 (CHEMBL2211966)
IC50 11500±n/a nM
Citation Kuduk, SDChang, RKGreshock, TJRay, WJMa, LWittmann, MSeager, MAKoeplinger, KAThompson, CDHartman, GDBilodeau, MT Identification of amides as carboxylic Acid surrogates for quinolizidinone-based m1 positive allosteric modulators. ACS Med Chem Lett3:1070-1074 (2012) 
 
Potassium voltage-gated channel subfamily H member 2
Name:Potassium voltage-gated channel subfamily H member 2
Type:Multi-pass membrane protein
Mol. Mass.:126672.65
Organism:Homo sapiens (Human)
Description:Q12809
Residue:1159
BDBM50400760
NameBDBM50400760
Synonyms:CHEMBL2204276
TypeSmall organic molecule
Emp. Form.C27H33N5O3
Mol. Mass.475.5826
SMILESCc1ccc(nc1)N1CCN(Cc2cc(C(=O)N[C@H]3CCCC[C@@H]3O)c(=O)n3ccccc23)CC1