Reaction Details
TargetPotassium voltage-gated channel subfamily H member 2
LigandBDBM50400763
Substrate/Competitorn/a
Meas. Tech.ChEMBL_880571 (CHEMBL2211966)
IC50 390±n/a nM
Citation Kuduk, SDChang, RKGreshock, TJRay, WJMa, LWittmann, MSeager, MAKoeplinger, KAThompson, CDHartman, GDBilodeau, MT Identification of amides as carboxylic Acid surrogates for quinolizidinone-based m1 positive allosteric modulators. ACS Med Chem Lett3:1070-1074 (2012) 
 
Potassium voltage-gated channel subfamily H member 2
Name:Potassium voltage-gated channel subfamily H member 2
Type:Multi-pass membrane protein
Mol. Mass.:126672.65
Organism:Homo sapiens (Human)
Description:Q12809
Residue:1159
BDBM50400763
NameBDBM50400763
Synonyms:CHEMBL2204275
TypeSmall organic molecule
Emp. Form.C28H31N5O3
Mol. Mass.485.5774
SMILESO[C@H]1CCCC[C@@H]1NC(=O)c1cc(CN2CCN(CC2)c2ccc(cc2)C#N)c2ccccn2c1=O