Reaction Details
TargetGlucose-dependent insulinotropic receptor
LigandBDBM50400773
Substrate/Competitorn/a
Meas. Tech.ChEMBL_879044 (CHEMBL2208916)
Ki 15±n/a nM
Citation Abdel-Magid, AF GPR119 Modulators for the Treatment of Diabetes, Obesity, and Related Diseases: Patent Highlight. ACS Med Chem Lett3:955-958 (2012) 
 
Glucose-dependent insulinotropic receptor
Name:Glucose-dependent insulinotropic receptor
Type:Protein
Mol. Mass.:36901.49
Organism:Homo sapiens (Human)
Description:Q8TDV5
Residue:335
BDBM50400773
NameBDBM50400773
Synonyms:CHEMBL2204984
TypeSmall organic molecule
Emp. Form.C23H24N10O
Mol. Mass.456.5031
SMILESCCc1cnc(nc1)N1CCC(CC1)n1ncc(COc2ccc(cc2)-n2cnnn2)c1C#N