Reaction Details
TargetGlucose-dependent insulinotropic receptor
LigandBDBM50400775
Substrate/Competitorn/a
Meas. Tech.ChEMBL_879044 (CHEMBL2208916)
Ki 99±n/a nM
Citation Abdel-Magid, AF GPR119 Modulators for the Treatment of Diabetes, Obesity, and Related Diseases: Patent Highlight. ACS Med Chem Lett3:955-958 (2012) 
 
Glucose-dependent insulinotropic receptor
Name:Glucose-dependent insulinotropic receptor
Type:Protein
Mol. Mass.:36901.49
Organism:Homo sapiens (Human)
Description:Q8TDV5
Residue:335
BDBM50400775
NameBDBM50400775
Synonyms:CHEMBL2204982
TypeSmall organic molecule
Emp. Form.C23H25FN8O3
Mol. Mass.480.4948
SMILESCn1nnnc1-c1ccc(OCc2cnn(C3CCN(CC3)C(=O)OC3(C)CC3)c2C#N)c(F)c1