Reaction Details
TargetHistone-lysine N-methyltransferase SETMAR
LigandBDBM50400779
Substrate/Competitorn/a
Meas. Tech.ChEMBL_879134 (CHEMBL2209105)
IC50>100000±n/a nM
Citation Verma, SKTian, XLaFrance, LVDuquenne, CSuarez, DPNewlander, KARomeril, SPBurgess, JLGrant, SWBrackley, JAGraves, APScherzer, DAShu, AThompson, COtt, HMAller, GSMachutta, CADiaz, EJiang, YJohnson, NWKnight, SDKruger, RGMcCabe, MTDhanak, DTummino, PJCreasy, CLMiller, WH Identification of Potent, Selective, Cell-Active Inhibitors of the Histone Lysine Methyltransferase EZH2. ACS Med Chem Lett3:1091-1096 (2012) 
 
Histone-lysine N-methyltransferase SETMAR
Name:Histone-lysine N-methyltransferase SETMAR
Type:PROTEIN
Mol. Mass.:78041.10
Organism:Homo sapiens (Human)
Description:ChEMBL_879134
Residue:684
BDBM50400779
NameBDBM50400779
Synonyms:CHEMBL2204998
TypeSmall organic molecule
Emp. Form.C29H35N7O2
Mol. Mass.513.6339
SMILESCC(C)n1ncc2c(cc(cc12)-c1ccc(nc1)N1CCN(C)CC1)C(=O)NCc1c(C)cc(C)[nH]c1=O