Reaction Details
TargetProtein arginine N-methyltransferase 1 [11-371]
LigandBDBM50400779
Substrate/Competitorn/a
Meas. Tech.ChEMBL_879139 (CHEMBL2209110)
IC50>100000±n/a nM
Citation Verma, SKTian, XLaFrance, LVDuquenne, CSuarez, DPNewlander, KARomeril, SPBurgess, JLGrant, SWBrackley, JAGraves, APScherzer, DAShu, AThompson, COtt, HMAller, GSMachutta, CADiaz, EJiang, YJohnson, NWKnight, SDKruger, RGMcCabe, MTDhanak, DTummino, PJCreasy, CLMiller, WH Identification of Potent, Selective, Cell-Active Inhibitors of the Histone Lysine Methyltransferase EZH2. ACS Med Chem Lett3:1091-1096 (2012) 
 
Protein arginine N-methyltransferase 1 [11-371]
Name:Protein arginine N-methyltransferase 1 [11-371]
Type:Protein
Mol. Mass.:41506.52
Organism:Homo sapiens (Human)
Description:Q99873[11-371]
Residue:361
BDBM50400779
NameBDBM50400779
Synonyms:CHEMBL2204998
TypeSmall organic molecule
Emp. Form.C29H35N7O2
Mol. Mass.513.6339
SMILESCC(C)n1ncc2c(cc(cc12)-c1ccc(nc1)N1CCN(C)CC1)C(=O)NCc1c(C)cc(C)[nH]c1=O