Reaction Details
TargetDNA (cytosine-5)-methyltransferase 1
LigandBDBM50400778
Substrate/Competitorn/a
Meas. Tech.ChEMBL_879148 (CHEMBL2209119)
IC50>100000±n/a nM
Citation Verma, SKTian, XLaFrance, LVDuquenne, CSuarez, DPNewlander, KARomeril, SPBurgess, JLGrant, SWBrackley, JAGraves, APScherzer, DAShu, AThompson, COtt, HMAller, GSMachutta, CADiaz, EJiang, YJohnson, NWKnight, SDKruger, RGMcCabe, MTDhanak, DTummino, PJCreasy, CLMiller, WH Identification of Potent, Selective, Cell-Active Inhibitors of the Histone Lysine Methyltransferase EZH2. ACS Med Chem Lett3:1091-1096 (2012) 
 
DNA (cytosine-5)-methyltransferase 1
Name:DNA (cytosine-5)-methyltransferase 1
Type:Enzyme
Mol. Mass.:183184.85
Organism:Homo sapiens (Human)
Description:P26358
Residue:1616
BDBM50400778
NameBDBM50400778
Synonyms:CHEMBL2204995
TypeSmall organic molecule
Emp. Form.C31H39N7O2
Mol. Mass.541.6871
SMILESCCCc1cc(C)[nH]c(=O)c1CNC(=O)c1cc(cc2n(ncc12)C(C)C)-c1ccnc(c1)N1CCN(C)CC1