Reaction Details
TargetRas-related protein Rap-1A
LigandBDBM50139187
Substrate/Competitorn/a
Meas. Tech.ChEMBL_879210 (CHEMBL2208523)
EC50 140±n/a nM
Citation Marsault, EPeterson, ML Macrocycles are great cycles: applications, opportunities, and challenges of synthetic macrocycles in drug discovery. J Med Chem54:1961-2004 (2011) 
 
Ras-related protein Rap-1A
Name:Ras-related protein Rap-1A
Type:PROTEIN
Mol. Mass.:20986.96
Organism:Homo sapiens (Human)
Description:ChEMBL_676192
Residue:184
BDBM50139187
NameBDBM50139187
Synonyms:4-(2-cyclohexylethyl)-23-oxo-8-oxa-1,15,17,21-tetraazapentacyclo[19.2.2.13,7.19,13.015,19]heptacosa-3(27),4,6,9(26),10,12,16,18-octaen-10-yl cyanide | CHEMBL159171
TypeSmall organic molecule
Emp. Form.C31H35N5O2
Mol. Mass.509.6419
SMILESO=C1CN2CCN1Cc1cc(Oc3cc(Cn4cncc4C2)ccc3C#N)ccc1CCC1CCCCC1