Reaction Details
TargetHigh affinity choline transporter 1
LigandBDBM50400797
Substrate/Competitorn/a
Meas. Tech.ChEMBL_879201 (CHEMBL2208514)
IC50 3200±n/a nM
Citation Marsault, EPeterson, ML Macrocycles are great cycles: applications, opportunities, and challenges of synthetic macrocycles in drug discovery. J Med Chem54:1961-2004 (2011) 
 
High affinity choline transporter 1
Name:High affinity choline transporter 1
Type:PROTEIN
Mol. Mass.:63194.33
Organism:Homo sapiens (Human)
Description:ChEMBL_1464247
Residue:580
BDBM50400797
NameBDBM50400797
Synonyms:CHEMBL2203622
TypeSmall organic molecule
Emp. Form.C18H22N2O2
Mol. Mass.298.3795
SMILESCn1c2OCC\C=C/CCCCOc3ccccc3-c1cn2