Reaction Details
TargetAngiotensin-converting enzyme
LigandBDBM50056258
Substrate/Competitorn/a
Meas. Tech.ChEMBL_879251 (CHEMBL2208604)
IC50 4±n/a nM
Citation Marsault, EPeterson, ML Macrocycles are great cycles: applications, opportunities, and challenges of synthetic macrocycles in drug discovery. J Med Chem54:1961-2004 (2011) 
 
Angiotensin-converting enzyme
Name:Angiotensin-converting enzyme
Type:Enzyme
Mol. Mass.:149709.01
Organism:Homo sapiens (Human)
Description:n/a
Residue:1306
BDBM50056258
NameBDBM50056258
Synonyms:(3R,6S)-3-Mercaptomethyl-4-oxo-5-aza-bicyclo[10.3.1]hexadeca-1(15),12(16),13-triene-6-carboxylic acid | CHEMBL148840
TypeSmall organic molecule
Emp. Form.C17H23NO3S
Mol. Mass.321.434
SMILESOC(=O)[C@@H]1CCCCCc2cccc(C[C@@H](CS)C(=O)N1)c2