Reaction Details
TargetProstaglandin E2 receptor EP3 subtype
LigandBDBM50400819
Substrate/Competitorn/a
Meas. Tech.ChEMBL_879335 (CHEMBL2208733)
Ki 17±n/a nM
Citation Meanwell, NA Synopsis of some recent tactical application of bioisosteres in drug design. J Med Chem54:2529-91 (2011) 
 
Prostaglandin E2 receptor EP3 subtype
Name:Prostaglandin E2 receptor EP3 subtype
Type:Enzyme
Mol. Mass.:43335.03
Organism:Homo sapiens (Human)
Description:P43115
Residue:390
BDBM50400819
NameBDBM50400819
Synonyms:CHEMBL2204338
TypeSmall organic molecule
Emp. Form.C23H17NO4S3
Mol. Mass.467.58
SMILESO=C(NS(=O)(=O)c1cccs1)\C=C\c1ccccc1S(=O)c1ccc2ccccc2c1