Reaction Details
TargetProstaglandin E2 receptor EP3 subtype
LigandBDBM50193921
Substrate/Competitorn/a
Meas. Tech.ChEMBL_879334 (CHEMBL2208732)
Ki 263±n/a nM
Citation Meanwell, NA Synopsis of some recent tactical application of bioisosteres in drug design. J Med Chem54:2529-91 (2011) 
 
Prostaglandin E2 receptor EP3 subtype
Name:Prostaglandin E2 receptor EP3 subtype
Type:Enzyme
Mol. Mass.:43335.03
Organism:Homo sapiens (Human)
Description:P43115
Residue:390
BDBM50193921
NameBDBM50193921
Synonyms:3-(2-(naphthalen-2-ylmethyl)phenyl)-N-(thiophen-2-ylsulfonyl)acrylamide | CHEMBL220802
TypeSmall organic molecule
Emp. Form.C24H19NO3S2
Mol. Mass.433.543
SMILESO=C(NS(=O)(=O)c1cccs1)\C=C\c1ccccc1Cc1ccc2ccccc2c1