Reaction Details
TargetSigma non-opioid intracellular receptor 1
LigandBDBM50400823
Substrate/Competitorn/a
Meas. Tech.ChEMBL_879320 (CHEMBL2208718)
Ki 3.4±n/a nM
Citation Meanwell, NA Synopsis of some recent tactical application of bioisosteres in drug design. J Med Chem54:2529-91 (2011) 
 
Sigma non-opioid intracellular receptor 1
Name:Sigma non-opioid intracellular receptor 1
Type:Enzyme Catalytic Domain
Mol. Mass.:25124.85
Organism:Homo sapiens (Human)
Description:Q99720
Residue:223
BDBM50400823
NameBDBM50400823
Synonyms:CHEMBL2204343
TypeSmall organic molecule
Emp. Form.C20H23ClFNO2Si
Mol. Mass.391.939
SMILESO[Si]1(CCN(CCCC(=O)c2ccc(F)cc2)CC1)c1ccc(Cl)cc1