Reaction Details
TargetFatty-acid amide hydrolase 1
LigandBDBM50204475
Substrate/Competitorn/a
Meas. Tech.ChEMBL_879293 (CHEMBL2208691)
Ki 3±n/a nM
Citation Meanwell, NA Synopsis of some recent tactical application of bioisosteres in drug design. J Med Chem54:2529-91 (2011) 
 
Fatty-acid amide hydrolase 1
Name:Fatty-acid amide hydrolase 1
Type:Protein
Mol. Mass.:63071.19
Organism:Homo sapiens (Human)
Description:O00519
Residue:579
BDBM50204475
NameBDBM50204475
Synonyms:1-(5-bromooxazol-2-yl)-7-phenylheptan-1-one | CHEMBL373555
TypeSmall organic molecule
Emp. Form.C16H18BrNO2
Mol. Mass.336.224
SMILESBrc1cnc(o1)C(=O)CCCCCCc1ccccc1