Reaction Details
TargetNeutrophil elastase
LigandBDBM50036051
Substrate/Competitorn/a
Meas. Tech.ChEMBL_879292 (CHEMBL2208690)
Ki 25±n/a nM
Citation Meanwell, NA Synopsis of some recent tactical application of bioisosteres in drug design. J Med Chem54:2529-91 (2011) 
 
Neutrophil elastase
Name:Neutrophil elastase
Type:Enzyme
Mol. Mass.:28532.38
Organism:Homo sapiens (Human)
Description:P08246
Residue:267
BDBM50036051
NameBDBM50036051
Synonyms:((S)-1-{(S)-2-[(S)-1-(Benzothiazole-2-carbonyl)-2-methyl-propylcarbamoyl]-pyrrolidine-1-carbonyl}-2-methyl-propyl)-carbamic acid benzyl ester benzyl (S)-1-((S)-2-(((S)-1-(benzo[d]thiazol-2-yl)-3-methyl-1-oxobutan-2-yl)carbamoyl)pyrrolidin-1-yl)-3-methyl-1-oxobutan-2-ylcarbamate
TypeSmall organic molecule
Emp. Form.C30H36N4O5S
Mol. Mass.564.696
SMILESCC(C)[C@H](NC(=O)OCc1ccccc1)C(=O)N1CCC[C@H]1C(=O)N[C@@H](C(C)C)C(=O)c1nc2ccccc2s1