Reaction Details
Target17-beta-hydroxysteroid dehydrogenase type 1
LigandBDBM17289
Substrate/Competitorn/a
Meas. Tech.ChEMBL_879294 (CHEMBL2208692)
Ki 9500±n/a nM
Citation Meanwell, NA Synopsis of some recent tactical application of bioisosteres in drug design. J Med Chem54:2529-91 (2011) 
 
17-beta-hydroxysteroid dehydrogenase type 1
Name:17-beta-hydroxysteroid dehydrogenase type 1
Type:Enzyme
Mol. Mass.:34945.13
Organism:Homo sapiens (Human)
Description:P14061
Residue:328
BDBM17289
NameBDBM17289
Synonyms:(1S,10R,11S,15S)-5-hydroxy-15-methyltetracyclo[8.7.0.0^{2,7}.0^{11,15}]heptadeca-2,4,6-trien-14-one Estrone Estrone, 15 Kestrone Unigen [2,4,6,7-3H]-Estrone | folliculin
TypeSteroid
Emp. Form.C18H22O2
Mol. Mass.270.3661
SMILES[H][C@@]12CCC(=O)[C@@]1(C)CC[C@]1([H])c3ccc(O)cc3CC[C@@]21[H]