Reaction Details
TargetPoly [ADP-ribose] polymerase 1
LigandBDBM50154723
Substrate/Competitorn/a
Meas. Tech.ChEMBL_879278 (CHEMBL2208631)
Ki 11±n/a nM
Citation Meanwell, NA Synopsis of some recent tactical application of bioisosteres in drug design. J Med Chem54:2529-91 (2011) 
 
Poly [ADP-ribose] polymerase 1
Name:Poly [ADP-ribose] polymerase 1
Type:n/a
Mol. Mass.:113114.22
Organism:Homo sapiens (Human)
Description:P09874
Residue:1014
BDBM50154723
NameBDBM50154723
Synonyms:6-(4-Fluoro-phenyl)-3,4-dihydro-2H-[1,4]diazepino[6,7,1-hi]indol-1-one | CHEMBL361675
TypeSmall organic molecule
Emp. Form.C17H13FN2O
Mol. Mass.280.2963
SMILESFc1ccc(cc1)-c1cc2cccc3C(=O)NCCn1c23