Reaction Details
TargetProstaglandin G/H synthase 1
LigandBDBM50056999
Substrate/Competitorn/a
Meas. Tech.ChEMBL_879288 (CHEMBL2208641)
IC50 3760±n/a nM
Citation Meanwell, NA Synopsis of some recent tactical application of bioisosteres in drug design. J Med Chem54:2529-91 (2011) 
 
Prostaglandin G/H synthase 1
Name:Prostaglandin G/H synthase 1
Type:Enzyme
Mol. Mass.:68692.62
Organism:Homo sapiens (Human)
Description:P23219
Residue:599
BDBM50056999
NameBDBM50056999
Synonyms:CHEMBL56367 | nimesulide
TypeSmall organic molecule
Emp. Form.C13H12N2O5S
Mol. Mass.308.31
SMILESCS(=O)(=O)Nc1ccc(cc1Oc1ccccc1)[N+]([O-])=O