Reaction Details
TargetNociceptin receptor
LigandBDBM50400875
Substrate/Competitorn/a
Meas. Tech.ChEMBL_880210 (CHEMBL2215339)
Ki 0.101±n/a nM
Citation Pike, VWRash, KSChen, ZPedregal, CStatnick, MAKimura, YHong, JZoghbi, SSFujita, MToledo, MADiaz, NGackenheimer, SLTauscher, JTBarth, VNInnis, RB Synthesis and evaluation of radioligands for imaging brain nociceptin/orphanin FQ peptide (NOP) receptors with positron emission tomography. J Med Chem54:2687-700 (2011) 
 
Nociceptin receptor
Name:Nociceptin receptor
Type:G Protein-Coupled Receptor (GPCR)
Mol. Mass.:40702.87
Organism:Homo sapiens (Human)
Description:P41146
Residue:370
BDBM50400875
NameBDBM50400875
Synonyms:CHEMBL2204353
TypeSmall organic molecule
Emp. Form.C21H24ClFN2O2S
Mol. Mass.422.944
SMILESNC(=O)[C@H](CN1CCC2(CC1)OCCc1cc(F)sc21)Cc1ccccc1Cl