Reaction Details
TargetSodium-dependent serotonin transporter
LigandBDBM50400902
Substrate/Competitorn/a
Meas. Tech.ChEMBL_880235 (CHEMBL2215364)
Ki 1.6±n/a nM
Citation Bang-Andersen, BRuhland, TJørgensen, MSmith, GFrederiksen, KJensen, KGZhong, HNielsen, SMHogg, SMørk, AStensbøl, TB Discovery of 1-[2-(2,4-dimethylphenylsulfanyl)phenyl]piperazine (Lu AA21004): a novel multimodal compound for the treatment of major depressive disorder. J Med Chem54:3206-21 (2011) 
 
Sodium-dependent serotonin transporter
Name:Sodium-dependent serotonin transporter
Type:Multi-pass membrane protein
Mol. Mass.:70322.51
Organism:Homo sapiens (Human)
Description:P31645
Residue:630
BDBM50400902
NameBDBM50400902
Synonyms:1-(2-(2,4-dimethylphenylsulfanyl)phenyl)piperazine Lu-AA21004 brintellix | vortioxetine hydrobromide
TypeSmall organic molecule
Emp. Form.C18H22N2S
Mol. Mass.298.446
SMILESCc1ccc(Sc2ccccc2N2CCNCC2)c(C)c1