Reaction Details
Target5-hydroxytryptamine receptor 1A
LigandBDBM50400899
Substrate/Competitorn/a
Meas. Tech.ChEMBL_880264 (CHEMBL2215842)
Ki 78±n/a nM
Citation Bang-Andersen, BRuhland, TJørgensen, MSmith, GFrederiksen, KJensen, KGZhong, HNielsen, SMHogg, SMørk, AStensbøl, TB Discovery of 1-[2-(2,4-dimethylphenylsulfanyl)phenyl]piperazine (Lu AA21004): a novel multimodal compound for the treatment of major depressive disorder. J Med Chem54:3206-21 (2011) 
 
5-hydroxytryptamine receptor 1A
Name:5-hydroxytryptamine receptor 1A
Type:n/a
Mol. Mass.:46122.49
Organism:Homo sapiens (Human)
Description:n/a
Residue:422
BDBM50400899
NameBDBM50400899
Synonyms:CHEMBL2204363
TypeSmall organic molecule
Emp. Form.C17H19ClN2S
Mol. Mass.318.864
SMILESCc1ccc(Sc2ccccc2N2CCNCC2)c(Cl)c1